Objetos
type: ConceptScheme
preferred label: Objectes @ca
preferred label: Objects @en

Silla
type: Concept
broader: Mobiliario de asiento individual con respaldo
definition: Del lat. sella. La composición de las silla se identifica con una estructura que puede articularse de maneras diferentes y que prevé un plano horizontal sostenido por cierto número de patas a las cuales se le añadieron un respaldo. Es por tanto, un asiento individual con respaldo. Desde la Antigüedad la silla ha ido asumiendo un sentido específico y autónomo que no la subordinada de manera exclusiva a su misión fundamental sino que adquiere una dimensión decorativa en algunos casos. La silla ha ido evolucionando, transformándose para resultar más confortable pero también se han conectado el devenir social y artístico. A partir del Renacimiento se desarrollaron modalidades más estables y cómodas, a veces tapizadas. A partir del siglo XVIII sus formas se multiplican y se adaptan a diferentes funciones: trabajo, juego, salón, comedor, trabajo, etc. Francia produjo lo que se puede considerar la primera silla confortable. A finales del siglo XIX, la silla presentó un nuevo reto en cuanto a materiales distintos de la madera, el hierro y el yeso irrumpen en la fabricación así como otros materiales nuevos. Se mezclan técnicas y se experimenta con las formas, haciendo de algunas sillas iconos del diseño.
definition: Del ll. cath?dra, íd., pres del gr. kathédra seient, amb canvi de laccentuació del ll. cl. cáthedra per la del ll. vg. catédra (cf. càtedra). La composició de les cadira s'identifica amb una estructura que pot articular-se de maneres diferents i que preveu un pla horitzontal sostingut per un cert nombre de potes a les quals se li van afegir un suport. És per tant, un seient individual amb respatler. Des de l'Antiguitat la cadira ha anat assumint un sentit específic i autònom que no la subordinada de manera exclusiva a la seua missió fonamental sinó que adquireix una dimensió decorativa en alguns casos. La cadira ha anat evolucionant, transformant-se per a resultar més confortable però també s'han connectat l'esdevenir social i artístic. A partir del Renaixement es van desenvolupar modalitats més estables i còmodes, a vegades entapissades. A partir del segle XVIII les seues formes es multipliquen i s'adapten a diferents funcions: treball, joc, saló, menjador, treball, etc. França va produir el que es pot considerar la primera cadira confortable. A la fi del segle XIX, la cadira va presentar un nou repte quant a materials diferents de la fusta, el ferro i l'algeps irrompen en la fabricació així com altres materials nous. Es mesclen tècniques i s'experimenta amb les formes, fent d'algunes cadires icones del disseny. @ca
definition: n. from Old French chaiere, from Latin cathedra, from Greek kathedra, from kata- down + hedra seat; compare cathedral. A chair is a piece of furniture for one person to sit on. Its composition is identified with a structure that can be articulated in different ways and that foresees a horizontal plane supported by a certain number of legs to which a backrest has been added. It is therefore an individual seat with a backrest. Since antiquity, the chair has gradually taken on a specific and autonomous meaning which does not exclusively subordinate it to its fundamental mission, but in some cases acquires a decorative dimension. The chair has been evolving, transforming itself to become more comfortable, but it has also been connected to the social and artistic evolution. From the Renaissance onwards, more stable and comfortable forms were developed, sometimes upholstered. From the 18th century onwards, their forms multiplied and adapted to different functions: work, play, lounge, dining room, work, etc. France produced what can be considered the first comfortable chair. At the end of the 19th century, the chair presented a new challenge in terms of materials other than wood, iron and plaster burst into manufacture as well as other new materials. Techniques were mixed and forms were experimented with, making some chairs icons of design. @en
in scheme: Objetos
narrower: Silla por función
narrower: Silla por forma
preferred label: Cadira @ca
preferred label: Chair @en

Silla por función
type: Concept
broader: Silla
preferred label: Cadira per funció @ca
preferred label: Chairs by function @en

Silla por forma
type: Concept
broader: Silla
preferred label: Cadira per forma @ca
preferred label: Chairs by form @en

Mobiliario de asiento individual con respaldo
type: Concept
narrower: Silla
preferred label: Mobiliari de seient individual amb respatler @ca
preferred label: Individual seating furniture with backrest @en