Objetos
type: ConceptScheme
preferred label: Objectes @ca
preferred label: Objects @en

Sofá camelback
type: Concept
alternative label: sofá espalda de camello
alternative label: sofà esquena de camell @ca
alternative label: camelback @en
broader: Sofá
definition: Son sofas con una joroba distintiva en el centro. Fue creado por el maestro diseñador de muebles Thomas Chippendale en el siglo XVIII. El diseño original se distinguía por sus brazos en forma de voluta y una base de madera tallada con patas cabriolé y pies en forma de voluta o de bola y garra. El sofá con respaldo de camello o serpentina ha sido muy popular durante al menos 200 años y sigue siendo una de las tres formas básicas de sofá (junto con los sofás Chesterfield y Club). El secreto de su éxito es la graciosa curva en el centro del respaldo, que tiene el poder de hacer que un mueble grande parezca más ligero y a la vez encantadoramente formal. A lo largo de los años se han ideado diversas variaciones de la forma original. Algunos sofás, como algunos camellos, tienen más de una joroba. Los camellones invertidos -con una hondonada en lugar de una joroba en el centro- también son populares. Dependiendo del diseño, las patas hacen referencia a un estilo concreto. Las patas convertibles son distintivas de las versiones influenciadas por la Reina Ana, mientras que las patas cónicas siguen un estilo Hepplewhite.
definition: Són sofàs amb un gep distintiu en el centre. Va ser creat pel mestre dissenyador de mobles Thomas Chippendale en el segle XVIII. El disseny original es distingia pels seus braços en forma de voluta i una base de fusta tallada amb potes cabriolé i peus en forma de voluta o de bola i arpa. El sofà amb respatler de camell o serpentina ha sigut molt popular durant almenys 200 anys i continua sent una de les tres formes bàsiques de sofà (juntament amb els sofàs Chesterfield i Club). El secret del seu èxit és la graciosa corba en el centre del suport, que té el poder de fer que un moble gran semble més lleuger i alhora formal. Al llarg dels anys s'han ideat diverses variacions de la forma original. Alguns sofàs, com alguns camells, tenen més d'un gep. Els geps invertits -amb una hondonada en lloc d'un gep en el centre- també són populars. Depenent del disseny, les potes fan referència a un estil concret. Les potes convertibles són distintives de les versions influenciades per la Reina Ana, mentre que les potes còniques segueixen un estil Hepplewhite. @ca
in scheme: Objetos
preferred label: Sofà camelback @ca
preferred label: Camelback sofa @en

Sofá
type: Concept
narrower: Sofá camelback
preferred label: Sofà @ca
preferred label: Sofa @en