Actividades
type: ConceptScheme
preferred label: Activitats @ca
preferred label: Activities @en

Madera laminada curvada
type: Concept
broader: Laminado
definition: Madera laminada, moldeada para obtener formas sinuosas. El procedimiento fue aplicado al mobiliario por Charles y Ray Eames a mediados de los años 40, basándose en experiencias realizadas durante la Segunda Guerra Mundial relacionadas con la producción de material bélico.
definition: Fusta laminada, modelada per a obtenir formes sinuoses. El procediment va ser aplicat al mobiliari per Charles i Ray Eames a mitjan anys 40, basant-se en experiències realitzades durant la Segona Guerra Mundial relacionades amb la producció de material bèl·lic. @ca
definition: Laminated wood, moulded into sinuous shapes. The process was applied to furniture by Charles and Ray Eames in the mid-1940s, based on wartime experiences during the Second World War in the production of war material. @en
in scheme: Actividades
preferred label: Fusta laminada corbada @ca
preferred label: Laminated Bentwood @en

Laminado
type: Concept
narrower: Madera laminada curvada
preferred label: Laminat @ca
preferred label: Lamination @en