Objetos
type: ConceptScheme
preferred label: Objectes @ca
preferred label: Objects @en

Asiento (componente)
type: Concept
broader: Componentes de mobiliario de asiento
definition: De asentar. Parte de los muebles de asiento sobre la que reposan las nalgas.
definition: De seure. Part dun seient, duna cadira, etc., sobre la qual hom seu. @ca
definition: n. Old English gesete; related to Old Norse sæti, Old High German gas?zi, Middle Dutch gesaet. Part of the seating furniture on which the buttocks rest. @en
in scheme: Objetos
preferred label: Seient (component) @ca
preferred label: Seat (components) @en

Componentes de mobiliario de asiento
type: Concept
narrower: Asiento (componente)
preferred label: Components del mobiliari de seient @ca
preferred label: Seating furniture components @en