Objetos
type: ConceptScheme
preferred label: Objectes @ca
preferred label: Objects @en

Comedor
type: Concept
broader: Vivienda
definition: Pequeños comedores cuando se trata de ampliaciones de salones. Use "comedor de diario" cuando se refiere a espacios similares que son extensiones de las cocinas o despensas.
definition: Xicotets menjadors quan es tracta d'ampliacions de salons. Use "menjador de diari" quan es referix a espais similars que són extensions de les cuines o rebostos. @ca
definition: Small dining rooms when referring to living room extensions. Use dining room when referring to similar spaces that are extensions of kitchens or pantries. @en
in scheme: Objetos
preferred label: Menjador @ca
preferred label: Dining room @en

Vivienda
type: Concept
narrower: Comedor