Objetos
type: ConceptScheme
preferred label: Objectes @ca
preferred label: Objects @en

Mesa de té
type: Concept
broader: Mesa auxiliar
definition: Este término se aplica a una variedad de pequeñas mesas destinadas a contener un servicio de té y otros artículos usados para servirlo. Puede tener una cubierta que puede ser levantada para usarse por separado como una bandeja y diferentes compartimentos. Desde el siglo XVIII ha habido muchos tipos de mesas destinadas a este uso. Generalmente están hechas en madera y a están veces decoradas.
definition: Aquest terme s'aplica a una varietat de xicotetes taules destinades a contindre un servei de te i altres articles usats per a servir-lo. Pot tindre una coberta que pot ser alçada per a usar-se per separat com una safata i diferents compartiments. Des del segle XVIII hi ha hagut molts tipus de taules destinades a aquest ús. Generalment estan fetes en fusta i a estan vegades decorades. @ca
definition: This term applies to a variety of small tables intended to contain a tea service and other items used to serve tea. It may have a cover that can be raised to be used separately as a tray and different compartments. Since the 18th century there have been many types of tables intended for this use. They are usually made of wood and are sometimes decorated. @en
in scheme: Objetos
preferred label: Taula de te @ca
preferred label: Tea table @en

Mesa auxiliar
type: Concept
narrower: Mesa de té
preferred label: Taula auxiliar @ca
preferred label: Fly table @en