Atributos físicos
type: ConceptScheme
preferred label: Atributs físics @ca
preferred label: Physical attributes @en

Mate
type: Concept
broader: Característica
definition: Del fr. mat. Que tiene una cualidad superficial opaca o sin brillo. Para referirse a imágenes bidimensionales que carecen de cualidades espaciales, y a áreas de color sin variaciones, use "plano".
definition: De làr. a-âh mât el rei ha mort, que sembla una frase persa mal interpretada pels àrabs, on mât és un adj. persa que significa esmaperdut, atabalat. Que té una qualitat superficial opaca o sense lluentor. Per a referir-se a imatges bidimensionals que manquen de qualitats espacials, i a àrees de color sense variacions, use "pla". @ca
definition: Having a dull or lusterless surface quality. To refer to two-dimensional images lacking spatial qualities, and to areas of color without variations, use "flat." @en
in scheme: Atributos físicos
preferred label: Mat @ca
preferred label: Matte @en

Característica
type: Concept
narrower: Mate
preferred label: Characteristic @en