Atributos físicos
type: ConceptScheme
preferred label: Atributs físics @ca
preferred label: Physical attributes @en

Opaco
type: Concept
alternative label: opacidad
broader: Característica
definition: Del lat. op?cus. Que impide el paso a la luz, a diferencia de diáfano.
definition: Que impedix el passe a la llum, a diferència de diàfan. @ca
definition: The quality or state of a substance or body of being impervious to rays of light. @en
in scheme: Atributos físicos
preferred label: Opac @ca
preferred label: Opacity @en

Característica
type: Concept
narrower: Opaco
preferred label: Characteristic @en