Actividades
type: ConceptScheme
preferred label: Activitats @ca
preferred label: Activities @en

Collage
type: Concept
broader: Procesos y técnicas de formación de imágenes
definition: Voz. fr. Se refiere a la técnica de hacer composiciones en dos dimensiones o muy bajo relieve en papel encolado, telas, fotografías u otros materiales sobre una superficie plana. Actualmente en esta técnica se emplean una gran variedad de materiales y cargas (incluso objetos), dependiendo de la creación del artista.
definition: Es referix a la tècnica de fer composicions en dos dimensions o molt baix relleu en paper encolat, teles, fotografies o altres materials sobre una superfície plana. Actualment en esta tècnica s'empren una gran varietat de materials i càrregues (fins i tot objectes), depenent de la creació de l'artista. @ca
definition: This refers to the technique of making two-dimensional or very low relief compositions on glued paper, fabrics, photographs or other materials on a flat surface. A wide variety of materials and fillers (including objects) are currently used in this technique, depending on the artist's creation. @en
in scheme: Actividades

Procesos y técnicas de formación de imágenes
type: Concept
narrower: Collage
preferred label: Processos i tècniques de formació d'imatges @ca
preferred label: Image-making processes and techniques @en