Actividades
type: ConceptScheme
preferred label: Activitats @ca
preferred label: Activities @en

Terciopelo
type: Concept
broader: Técnica de tejido
definition: De tercio 'tercero' y pelo. Tejido de superficie pilosa o bucles obtenidos a base de una tela de sostén y un elemento suplementario, que generan una superficie velluda. Hay muchas variedades de terciopelos y pueden ser por trama o por urdimbre, siendo estos últimos los más frecuentes y apreciados
definition: De terç 'tercer' i pèl. Teixit de superfície pilosa o bucles obtinguts a base d'una tela de sustentació i un element suplementari, que generen una superfície *velluda. Hi ha moltes varietats de velluts i poden ser per trama o per ordit, sent aquests últims els més freqüents i benvolguts @ca
definition: n. From the Medieval Latin "velvetum", and Middle English "veluet" "velvet" among others. It refers to a silk textile fabric that has a short, dense and smooth piled surface. The pile is produced by a pile warp that is raised in loops above a ground weave through the introduction of rods during the weaving. There are many types of velvet, classified depending on the nature of the pile (broderie velvet, ciselè velvet, cut velvet, pile-on-pile velvet, uncut velvet, etc.). @en
in scheme: Actividades
preferred label: Vellut @ca
preferred label: Velvet @en

Técnica de tejido
type: Concept
narrower: Terciopelo
preferred label: Tècniques de teixit @ca
preferred label: Weaving techniques @en