Objetos
type: ConceptScheme
preferred label: Objectes @ca
preferred label: Objects @en

Silla elástica
type: Concept
broader: Silla por forma
definition: Silla patentada por Samuel Gragg en 1808 que reproduce las curvas de la silla griega Klismos que aparece representada en el arte antiguo. Presenta una decoración en forma de hojas de acanto, plumas de pavo real y patas de pezuña. Lo más innovador en su producción es el uso de madera curvada al vapor que permitió formar cada brazo a partir de una sola pieza, consiguiendo un diseño ligero y flexible, menos costoso de producir. Por esto se considera un diseño innovador y precursor del diseño europeo Thonet (Gebrüder Thonet) en 1853.
definition: Patentada per Samuel Gragg en 1808 que reprodueix les corbes de la cadira grega Klismos que apareix representada en l'art antic. Presenta una decoració en forma de fulles d'acant, plomes de paó i potes de peülla. El més innovador en la seua producció és l'ús de fusta corbada al vapor que va permetre formar cada braç a partir d'una sola peça, aconseguint un disseny lleuger i flexible, menys costós de produir. Per això es considera un disseny innovador i precursor del disseny europeu Thonet (Gebrüder Thonet) en 1853. @ca
definition: Patented by Samuel Gragg in 1808, reproduces the curves of the Greek Klismos chair seen in ancient art. It is decorated with acanthus leaves, peacock feathers and clovedn hoof feet. The most innovative aspect of its production was the use of steam-bent wood, which allowed each arm to be formed from a single piece. This resulted in a lightweight, flexible design that was less expensive to produce. For this reason, it is considered an innovative design and a forerunner of the European Thonet design (Gebrüder Thonet) in 1853. @en
in scheme: Objetos
preferred label: Cadira elàstica @ca
preferred label: Elastic chair @en

Silla por forma
type: Concept
narrower: Silla elástica
preferred label: Cadira per forma @ca
preferred label: Chairs by form @en