Materiales
type: ConceptScheme
preferred label: Materials @ca

Fresno
type: Concept
broader: Madera dura
definition: Del lat. frax?nus. La madera de fresno es una madera muy polivalente y utilizada. Ofrece una excelente relación entre calidad y resistencia. Es dura, pesada, de grano grueso y elástica. Aunque es adecuada para macizo, se ha preferido aplicarla en chapas y también en torneados. Se emplea para hacer muebles de madera curvada. Si bien se la pueden encontrar en la fabricación de muebles finos o de ebanistería, es mucho más usual verla en ámbitos más exigentes: cocinas, armarios
definition: del ll. frax?nus. La fusta de freixe és una fusta molt polivalent i utilitzada. Ofereix una excel·lent relació entre qualitat i resistència. És dura, pesada, de gra gruixut i elàstica. Encara que és adequada per a massís, s'ha preferit aplicar-la en xapes i també en tornejats. S'empra per a fer mobles de fusta corbada. Si bé li la poden trobar en la fabricació de mobles fins o d'ebenisteria, és molt més usual veure-la en àmbits més exigents: cuines, armaris @ca
definition: Old English æsc, name of the corresponding runic letter] : the ligature æ used in Old English and some phonetic alphabets to represent a low front vowel \\a\\. Any of a genus (Fraxinus) of trees of the olive family with pinnate leaves, thin furrowed bark, and gray branchlets. Ash is a very versatile and widely used wood. It offers an excellent ratio between quality and strength. It is hard, heavy, coarse-grained and elastic. Although it is suitable for solid wood, it has been preferred for use in veneers and also in turnings. It is used to make bentwood furniture. Although it can be found in the manufacture of fine furniture or joinery, it is much more common to see it in more demanding areas: kitchens, wardrobes... @en
in scheme: Materiales
preferred label: Freixe @ca
preferred label: Ash @en

Madera dura
type: Concept
narrower: Fresno
preferred label: Fusta dura @ca
preferred label: Hardwood @en