Objetos
type: ConceptScheme
preferred label: Objectes @ca
preferred label: Objects @en

Servilletero
type: Concept
broader: Grupo de elementos que serven para contener o servir alimentos.
definition: Aro en que se pone arrollada la servilleta. También utensilio para poner las servilletas de papel.
definition: Cércol en què es posa atropellada el tovalló. També utensili per a posar els tovallons de paper. @ca
definition: Ring in which the napkin is rolled up. Also a utensil to put paper napkins in. @en
in scheme: Objetos
preferred label: Tovallonera @ca
preferred label: Napkin holder @en

Grupo de elementos que serven para contener o servir alimentos.
type: Concept
narrower: Servilletero
preferred label: Contenidors per servir i consumir aliments @ca
preferred label: Containers for use in a kitchen, or for cooking. @en