Objetos
type: ConceptScheme
preferred label: Objectes @ca
preferred label: Objects @en

Mesa por localización o contexto
type: Concept
broader: Mesa
definition: Jerarquía que distingue los tipos de mesa según su localización y contexto.
definition: Jerarquia que distingeix els tipus de taula per la seua localització i context. @ca
definition: A hierarchy that distinguishes between types of tables according to their location or context. @en
in scheme: Objetos
narrower: Mesa de centro
preferred label: Taula per localització i context @ca
preferred label: Table by location or context @en

Mesa de centro
type: Concept
broader: Mesa por localización o contexto
preferred label: Taula de centre @ca
preferred label: Center table @en

Mesa
type: Concept
narrower: Mesa por localización o contexto
preferred label: Taula @ca
preferred label: Table @en