Materiales
type: ConceptScheme
preferred label: Materials @ca

Olivo
type: Concept
alternative label: Olea europeae var. sativa
alternative label: Olive tree @en
broader: Madera dura
definition: Del lat. vulg. ol?vus, y este del lat. ol?va 'olivo', 'aceituna'. Árbol de la familia de las oleáceas, con tronco corto, grueso y torcido, copa ancha y ramosa que se eleva hasta cuatro o cinco metros, hojas persistentes coriáceas, opuestas, elípticas, enteras, estrechas, puntiagudas, verdes y lustrosas por el haz y blanquecinas por el envés, flores blancas, pequeñas, en ramitos axilares, y por fruto la aceituna, que es drupa ovoide de dos a cuatro centímetros de eje mayor, según las castas, de sabor algo amargo, color verde amarillento, morado en algunas variedades, y con un hueso grande y muy duro que encierra la semilla. Originario de Oriente, es muy cultivado en España para extraer del fruto el aceite común. Madera* de color marrón amarillento, veteada de negro a gris. Está cuajada de nudos. Tiene anillos de crecimiento diferenciados, de poros difusos, agrupados en filas radiales. Presenta parénquima longitudinal apotraqueal difuso, paratraqueal vasicéntrico y aliforme y marginal. Es muy dura, de grano finísimo y resistente al corte debido a la presencia de resinas. La madera de raíz* de olivo se empleó en España en el siglo XVII sólo para muebles de pequeño tamaño (mesitas, etc.) por la falta de adherencia entre sus capas, aunque se prodigó más en marqueterías, estimándose las chapas de la raíz y las ricas en nudos; también es frecuente en los chapeados catalanes del XVIII. En general esta madera, torneada y esculpida, se emplea en tallas, ebanistería de lujo, torneados, taraceados y utensilios domésticos.
definition: De oliva. Arbre perennifoli de la família de les oleàcies (Olea europaea), de soca i tronc gruixuts, flors blanques petites en ramells i fruits en drupa comestibles, coneguts com a olives. Per extensió fusta de lolivera. @ca
definition: An evergreen oleaceous tree, Olea europaea, of the Mediterranean region but cultivated elsewhere, having white fragrant flowers, and edible shiny black fruits. The wood of the olive tree, used for ornamental work. @en
in scheme: Materiales
preferred label: Olivera @ca
preferred label: Olive @en

Madera dura
type: Concept
narrower: Olivo
preferred label: Fusta dura @ca
preferred label: Hardwood @en