Objetos
type: ConceptScheme
preferred label: Objectes @ca
preferred label: Objects @en

Cartas
type: Concept
alternative label: Juegos de cartas
alternative label: Jocs de cartes @ca
broader: Juego de mesa y tablero
definition: Conjunto de naipes y otros artículos que se utilizan, por lo general, en juegos de mesa donde hay turnos entre los jugadores.
definition: Conjunt de naips i altres articles que s'utilitzen, en general, en jocs de taula on hi ha torns entre els jugadors. @ca
definition: Sets composed of playing cards plus other items designed to be used together in games in which the primary activity during a round of play involves the use of the playing cards. @en
in scheme: Objetos
narrower: Baraja española
preferred label: Cartes @ca
preferred label: Cards games @en

Baraja española
type: Concept
broader: Cartas

Juego de mesa y tablero
type: Concept
narrower: Cartas
preferred label: Joc de taula i tauler @ca