Actividades
type: ConceptScheme
preferred label: Activitats @ca
preferred label: Activities @en

Capitoneado
type: Concept
broader: Henchido
definition: Henchido con base de resortes, que se fija con bastas. Las puntadas producen zonas rehundidas en la superficie de la tapicería que se aprovechan con fines decorativos, al disponerlos a intervalos regulares y rematarlos con botones.
definition: Ple amb base de ressorts, que es fixa amb bastes. Les puntades produïxen zones reafonades en la superfície de la tapisseria que s'aprofiten amb finalitats decoratius, en disposar-los a intervals regulars i rematar-los amb botons. @ca
definition: Spring-loaded padding, which is fixed with batts. The stitches produce recessed areas in the surface of the upholstery which are used for decorative purposes by arranging them at regular intervals and finishing them with buttons. @en
in scheme: Actividades
preferred label: Capitonat @ca
preferred label: Button tufting @en

Henchido
type: Concept
narrower: Capitoneado
preferred label: Farcit @ca
preferred label: Stuffed @en