Objetos
type: ConceptScheme
preferred label: Objectes @ca
preferred label: Objects @en

Peluche
type: Concept
alternative label: Muñeco de peluche
broader: Muñeca
definition: Del fr. peluche. Juguete relleno y cubierto de materiales blandos, que a menudo representa a un animal o una figura humana.
definition: Del fr. peluche, íd., del fr. ant. peluchier netejar pèls embullats, del ll. vg. *piluccare, íd., forma sincopada de *pilucicare, freqüentatiu de *pilucare, del b. ll. pilare depilar 1a font: 1917, DOrt. Joguet farcit i cobert de materials blans, que sovint representa a un animal o una figura humana. @ca
definition: Toys, most often animal representations or dolls, filled and covered with soft materials. @en
in scheme: Objetos
preferred label: Peluix @ca
preferred label: Stuffed toy @en

Muñeca
type: Concept
narrower: Peluche
preferred label: Nina @ca
preferred label: Doll @en