Objects
type: ConceptScheme
preferred label: Objetos @es
preferred label: Objectes @ca

Moving library
type: Concept
alternative label: moving libraries
broader: Bookcase
definition: Librería baja de planta cuadrada y forma prismática o piramidal, con estantes abiertos hacia los cuatro frentes limitados lateralmente por montantes y divididos por paneles fijos o por travesaños móviles. A veces, gira sobre un eje central y suelen estar colocadas sobre ruedas giratorias para facilitar su fácil desplazamiento. Tiene origen en el período Victoriano, en Inglaterra. @es
definition: Llibreria baixa de planta quadrada i forma prismàtica o piramidal, amb prestatges oberts cap als quatre fronts limitats lateralment per muntants i dividits per panells fixos o per travessers mòbils. A vegades, gira sobre un eix central i solen estar col·locades sobre rodes giratòries per a facilitar el seu fàcil desplaçament. Té origen en el període Victoriano, a Anglaterra. @ca
definition: Low bookcase with a square floor plan and a prismatic or pyramidal shape. It has shelves open to the four fronts limited laterally by uprights and divided by fixed panels or by movable crosspieces. These libraries sometimes rotate on a central axis and are usually placed on swivel castors to facilitate easy movement. Its origin comes from from the Victorian period in England.
in scheme: Objects
preferred label: Librería giratoria @es
preferred label: Llibreria giratòria @ca

Bookcase
type: Concept
narrower: Moving library
preferred label: Librería @es
preferred label: Llibreria @ca