Actividades
type: ConceptScheme
preferred label: Activitats @ca
preferred label: Activities @en

Encolado (adherir)
type: Concept
broader: Pegado
definition: Del part. de encolar.Aplicación de un líquido penetrante para rellenar los poros, para aislar revestimientos o para adecuar superficies para recibir revestimientos.
definition: De encolar. Aplicació d'un líquid penetrant per a emplenar els porus, per a aïllar revestiments o per a adequar superfícies per a rebre revestiments. @ca
definition: Application of a penetrating liquid to fill pores, to isolate coatings, or to make surfaces suitable to receive coatings. @en
in scheme: Actividades
preferred label: Encolat @ca
preferred label: Sizing @en

Pegado
type: Concept
narrower: Encolado (adherir)
preferred label: Pegat @ca
preferred label: Gluing @en