Objetos
type: ConceptScheme
preferred label: Objectes @ca
preferred label: Objects @en

Huevera
type: Concept
alternative label: huevero
alternative label: egg stands @en
broader: Grupo de elementos que serven para contener o servir alimentos.
definition: Recipiente de porcelana, loza, metal, plástico u otro material con forma semi ovalada que se emplea para servir individualmente los huevos pasados por agua. También se emplea este término para referirse al receptáculo que sirve para transportar o guardar los huevos. Generalmente está hecho de alambre enroscado.
definition: Recipient de porcellana, pisa, metall, plàstic o un altre material amb forma semi ovalada que s'empra per a servir individualment els ous passats per aigua. També s'empra este terme per a referir-se al receptacle que servix per a transportar o guardar els ous. Generalment està fet de filferro enroscat. @ca
definition: A container of porcelain, stoneware, metal, plastic or other material with a semi-oval shape used to serve soft-boiled eggs individually. This term is also used to refer to the container used to transport or store eggs. It is usually made of coiled wire. @en
in scheme: Objetos
preferred label: Ouera @ca
preferred label: Eggcup @en

Grupo de elementos que serven para contener o servir alimentos.
type: Concept
narrower: Huevera
preferred label: Contenidors per servir i consumir aliments @ca
preferred label: Containers for use in a kitchen, or for cooking. @en