Objetos
type: ConceptScheme
preferred label: Objectes @ca
preferred label: Objects @en

Diseño de interiores
type: Concept
alternative label: Interiorismo
alternative label: Interiorisme @ca
broader: Diseño de entorno
definition: Es disciplina proyectual involucrada en el proceso de formar la experiencia del espacio interior, con la manipulación del volumen espacial así como el tratamiento superficial. El diseño interior indaga en aspectos de la psicología ambiental, la arquitectura, y del diseño de producto, además de la decoración tradicional.
definition: És disciplina projectual involucrada en el procés de formar l'experiència de l'espai interior, amb la manipulació del volum espacial així com el tractament superficial. El disseny interior indaga en aspectes de la psicologia ambiental, l'arquitectura, i del disseny de producte, a més de la decoració tradicional. @ca
definition: It is a design discipline involved in the process of shaping the experience of interior space, with the manipulation of spatial volume as well as surface treatment. Interior design explores aspects of environmental psychology, architecture and product design, as well as traditional decoration. @en
in scheme: Objetos
narrower: Edificio público
narrower: Comercio
narrower: Vivienda
preferred label: Disseny d'interiors @ca
preferred label: Interior design @en

Edificio público
type: Concept
broader: Diseño de interiores

Comercio
type: Concept
broader: Diseño de interiores

Vivienda
type: Concept
broader: Diseño de interiores

Diseño de entorno
type: Concept
narrower: Diseño de interiores