Actividades
type: ConceptScheme
preferred label: Activitats @ca
preferred label: Activities @en

Decapado
type: Concept
broader: Procesos y técnicas sobre madera
definition: De decapar. Técnica de acabado superficial de varios objetos que consiste en eliminar parcialmente, de manera mecánica o química, la capa superficial de una pintura o de un barniz para que se vea el sustrato inferior.
definition: Tècnica d'acabat superficial de diversos objectes que consisteix a eliminar parcialment, de manera mecànica o química, la capa superficial d'una pintura o d'un vernís perquè es veja el substrat inferior. @ca
definition: Surface finishing technique for several objects that consists of partially removing, in a mechanical or chemical way, the surface layer of a paint or varnish so that the substrate underneath can be seen. @en
in scheme: Actividades
preferred label: Decapatge @ca
preferred label: Stripping @en

Procesos y técnicas sobre madera
type: Concept
narrower: Decapado
preferred label: Processos i tècniques sobre fusta @ca
preferred label: Processes and techniques for woodworking @en