Actividades
type: ConceptScheme
preferred label: Activitats @ca
preferred label: Activities @en

Enlucido
type: Concept
broader: Revestido
definition: Capa de yeso, estuco u otra mezcla, que se da a las paredes de una casa con objeto de obtener una superficie tersa. En el contexto de la arquitectura en general, el enlucido es aplicado a los muros o cielos con golpes amplios, con un rápido secado.
definition: Capa d'algeps, estuc o una altra mescla, que es dona a les parets d'una casa a fi d'obtindre una superfície llisa. En el context de l'arquitectura en general, l'arrebossat és aplicat als murs o cels amb colps amplis, amb un ràpid assecat. @ca
definition: A layer of plaster, stucco or other mixture, given to the walls of a house in order to obtain a smooth surface. In the context of architecture in general, plaster is applied to walls or ceilings with broad strokes, with rapid drying. @en
in scheme: Actividades
narrower: Estucado
preferred label: Arrebossat @ca
preferred label: Plastering @en

Estucado
type: Concept
broader: Enlucido
preferred label: Estucat @ca
preferred label: Stuccoing @en

Revestido
type: Concept
narrower: Enlucido
preferred label: Revestit @ca
preferred label: Coating @en