Actividades
type: ConceptScheme
preferred label: Activitats @ca
preferred label: Activities @en

Procesos y técnicas de unión y adhesión
type: Concept
broader: Procesos y técnicas por tipo específico
definition: Conjunto de técnicas y procedimientos empleados en el proceso de juntar dos o más piezas de manera firme y estable. También se encontrarán las técnicas y procedimientos para la unión de dos superficies por medio de una composición generalmente viscosa y pegajosa, tal como un adhesivo, o a través de una fuerza física o química.
definition: Conjunt de tècniques i procediments emprats en el procés d'ajuntar dos o més peces de manera ferma i estable. També es trobaran les tècniques i procediments per a la unió de dues superfícies per mitjà d'una composició generalment viscosa i enganxosa, tal com un adhesiu, o a través d'una força física o química. @ca
definition: A set of techniques and procedures used in the process of joining two or more parts together in a firm and stable manner. The techniques and procedures for joining two surfaces by means of a generally viscous and sticky composition, such as an adhesive, or by means of a physical or chemical force. @en
in scheme: Actividades
narrower: Procesos y técnicas para cubrir superficies
narrower: Unión
narrower: Adhesión
preferred label: Processos i tècniques d'unió i adhesió @ca
preferred label: Additive and joining processes and techniques @en

Procesos y técnicas para cubrir superficies
type: Concept
broader: Procesos y técnicas de unión y adhesión
preferred label: Processos i tècniques per a cobrir superfícies @ca
preferred label: Surface covering processes and techniques @en

Unión
type: Concept
broader: Procesos y técnicas de unión y adhesión
preferred label: Unió @ca
preferred label: Join @en

Adhesión
type: Concept
broader: Procesos y técnicas de unión y adhesión
preferred label: Adhesió @ca
preferred label: Adhesion @en

Procesos y técnicas por tipo específico
type: Concept
narrower: Procesos y técnicas de unión y adhesión
preferred label: Processos i tècniques per tipus específic @ca
preferred label: Processes and techniques by specific type @en