Objetos
type: ConceptScheme
preferred label: Objectes @ca
preferred label: Objects @en

Portarretratos
type: Concept
alternative label: Portarretrato
broader: Decoración
definition: Marco portátil de fotografías con un pie al dorso sobre el que se apoya para mantenerse levantado.
definition: Marc portàtil de fotografies amb un peu al dors sobre el qual se secunda per a mantindre's alçat. @ca
definition: Portable photo frame with a foot on the back on which it stands upright. @en
in scheme: Objetos
preferred label: Marc de fotos @ca
preferred label: Photo frames @en

Decoración
type: Concept
narrower: Portarretratos
preferred label: Decoració @ca
preferred label: Decoration @en