Objectes
type: ConceptScheme
preferred label: Objetos @es
preferred label: Objects @en

Joguet mecànic
type: Concept
alternative label: joguina mecànica
broader: Joguets per funcionament
definition: Úsese para juguetes que tienen como principal característica de diseño algún mecanismo o dispositivo mecánico. @es
definition: Use's per a joguets que tenen com a principal característica de disseny algun mecanisme o dispositiu mecànic.
definition: Toys that have some mechanism or mechanical device as a primary design feature. @en
in scheme: Objectes
narrower: Joguet de corda
preferred label: Juguete mecánico @es
preferred label: Mechanical toy @en

Joguet de corda
type: Concept
broader: Joguet mecànic
preferred label: Juguete de cuerda @es
preferred label: Windup toy @en

Joguets per funcionament
type: Concept
narrower: Joguet mecànic
preferred label: Juguete por funcionamiento @es
preferred label: Toys by mode of operation @en