Objetos
type: ConceptScheme
preferred label: Objectes @ca
preferred label: Objects @en

Luz de señalización
type: Concept
broader: Artefactos de iluminación por función
definition: Dos o más luces en la misma dirección horizontal usadas como una ayuda para la navegación náutica o aeronáutica, tal como aquellas luces que indican un canal o marca al final de una pista de aterrizaje.
definition: Dos o més llums en la mateixa direcció horitzontal usades com una ajuda per a la navegació nàutica o aeronàutica, tal com aquelles llums que indiquen un canal o marca al final d'una pista d'aterratge. @ca
definition: Two or more lights in the same horizontal direction used as an aid to nautical or aeronautical navigation, such as those lights indicating a channel or marking the end of a runway. @en
in scheme: Objetos
preferred label: Llum de senyalització @ca
preferred label: Range lights @en

Artefactos de iluminación por función
type: Concept
narrower: Luz de señalización
preferred label: Artefacte d'il·luminació per funció @ca
preferred label: Lighting devices by function @en